Reaction Details
TargetMacrophage colony-stimulating factor 1 receptor
LigandBDBM50291109
Substrate/Competitorn/a
Meas. Tech.ChEBML_47907
IC50 1600±n/a nM
Citation Myers, MRSetzer, NNSpada, APPersons, PELy, CQMaguire, MPZulli, ALCheney, DLZilberstein, AJohnson, SEFranks, CFMitchell, KJ The synthesis and SAR of new 4-(N-alkyl-N-phenyl)amino-6,7-dimethoxyquinazolines and 4-(N-alkyl-N-phenyl)aminopyrazolo[3,4-Bioorg Med Chem Lett7:421-424 (1997)    Article
 
Macrophage colony-stimulating factor 1 receptor
Name:Macrophage colony-stimulating factor 1 receptor
Type:Protein
Mol. Mass.:107979.48
Organism:Homo sapiens (Human)
Description:P07333
Residue:972
BDBM50291109
NameBDBM50291109
Synonyms:(6,7-Dimethyl-quinazolin-4-yl)-methyl-m-tolyl-amine; hydrochloride | CHEMBL554566
TypeSmall organic molecule
Emp. Form.C18H19N3
Mol. Mass.277.3636
SMILESCN(c1cccc(C)c1)c1ncnc2cc(C)c(C)cc12