Reaction Details
TargetEpidermal growth factor receptor
LigandBDBM50291117
Substrate/Competitorn/a
Meas. Tech.ChEBML_63790
IC50>50000±n/a nM
Citation Myers, MRSetzer, NNSpada, APPersons, PELy, CQMaguire, MPZulli, ALCheney, DLZilberstein, AJohnson, SEFranks, CFMitchell, KJ The synthesis and SAR of new 4-(N-alkyl-N-phenyl)amino-6,7-dimethoxyquinazolines and 4-(N-alkyl-N-phenyl)aminopyrazolo[3,4-Bioorg Med Chem Lett7:421-424 (1997)    Article
 
Epidermal growth factor receptor
Name:Epidermal growth factor receptor
Type:Receptor Kinase Domain
Mol. Mass.:134279.59
Organism:Homo sapiens (Human)
Description:P00533
Residue:1210
BDBM50291117
NameBDBM50291117
Synonyms:CHEMBL135928 | Methyl-phenyl-(2,6,7-trimethoxy-quinazolin-4-yl)-amine
TypeSmall organic molecule
Emp. Form.C18H19N3O3
Mol. Mass.325.3618
SMILESCOc1cc2nc(OC)nc(N(C)c3ccccc3)c2cc1OC