Reaction Details
TargetEpidermal growth factor receptor
LigandBDBM50273281
Substrate/Competitorn/a
Meas. Tech.ChEBML_63790
IC50 4000±n/a nM
Citation Myers, MRSetzer, NNSpada, APPersons, PELy, CQMaguire, MPZulli, ALCheney, DLZilberstein, AJohnson, SEFranks, CFMitchell, KJ The synthesis and SAR of new 4-(N-alkyl-N-phenyl)amino-6,7-dimethoxyquinazolines and 4-(N-alkyl-N-phenyl)aminopyrazolo[3,4-Bioorg Med Chem Lett7:421-424 (1997)    Article
 
Epidermal growth factor receptor
Name:Epidermal growth factor receptor
Type:Receptor Kinase Domain
Mol. Mass.:134279.59
Organism:Homo sapiens (Human)
Description:P00533
Residue:1210
BDBM50273281
NameBDBM50273281
Synonyms:CHEMBL456375 N-methyl-4-anilino-6,7-dimethoxyquinazoline
TypeSmall organic molecule
Emp. Form.C17H17N3O2
Mol. Mass.295.3358
SMILESCOc1cc2ncnc(N(C)c3ccccc3)c2cc1OC