Reaction Details
TargetMacrophage colony-stimulating factor 1 receptor
LigandBDBM50291116
Substrate/Competitorn/a
Meas. Tech.ChEBML_47907
IC50 2000±n/a nM
Citation Myers, MRSetzer, NNSpada, APPersons, PELy, CQMaguire, MPZulli, ALCheney, DLZilberstein, AJohnson, SEFranks, CFMitchell, KJ The synthesis and SAR of new 4-(N-alkyl-N-phenyl)amino-6,7-dimethoxyquinazolines and 4-(N-alkyl-N-phenyl)aminopyrazolo[3,4-Bioorg Med Chem Lett7:421-424 (1997)    Article
 
Macrophage colony-stimulating factor 1 receptor
Name:Macrophage colony-stimulating factor 1 receptor
Type:Protein
Mol. Mass.:107979.48
Organism:Homo sapiens (Human)
Description:P07333
Residue:972
BDBM50291116
NameBDBM50291116
Synonyms:(6,7-Dimethoxy-quinazolin-4-yl)-methyl-p-tolyl-amine; hydrochloride | CHEMBL545538
TypeSmall organic molecule
Emp. Form.C18H19N3O2
Mol. Mass.309.3624
SMILESCOc1cc2ncnc(N(C)c3ccc(C)cc3)c2cc1OC