Reaction Details
TargetVasopressin V1a/V1b receptor
LigandBDBM50291329
Substrate/Competitorn/a
Meas. Tech.ChEMBL_211080 (CHEMBL812861)
IC50 9.5±n/a nM
Citation Moutiez, MLippens, GSergheraert, CTartar, A Vasopressin trisulphide: synthesis, NMR study and affinity studies with V1 and V2 subtypes receptors Bioorg Med Chem Lett7:719-724 (1997)    Article
 
Vasopressin V1a/V1b receptor
Name:Vasopressin V1a/V1b receptor
Synonyms:Vasopressin V1 receptor
Type:n/a
Mol. Mass.:n/a
Description:ASSAY_ID of ChEMBL is 214265
Components:This complex has 2 components.
Component 1
Name:Vasopressin V1a receptor
Type:Enzyme Catalytic Domain
Mol. Mass.:47674.81
Organism:RAT
Description:VASOPRESSIN V1A AVPR1A RAT::P30560
Residue:424
Component 2
Name:Vasopressin V1b receptor
Synonyms:Avpr1b VASOPRESSIN V1B Vasopressin receptor
Type:Enzyme Catalytic Domain
Mol. Mass.:47104.48
Organism:RAT
Description:VASOPRESSIN V1B AVPR1B RAT::P48974
Residue:425
BDBM50291329
NameBDBM50291329
Synonyms:8-arginine vasopressin trisulphide | CHEMBL267405
TypeSmall organic molecule
Emp. Form.C46H65N15O12S3
Mol. Mass.1116.297
SMILESN[C@@H]1CSSSC[C@H](NC(=O)[C@H](CC(N)=O)NC(=O)[C@@H](CCC(N)=O)NC(=O)[C@H](Cc2ccccc2)NC(=O)[C@@H](Cc2ccc(O)cc2)NC1=O)C(=O)N1CCC[C@@H]1C(=O)N[C@@H](CCCNC(N)=N)C(=O)NCC(N)=O