Reaction Details
TargetNeutrophil collagenase
LigandBDBM50291447
Substrate/Competitorn/a
Meas. Tech.ChEBML_105217
IC50 12±n/a nM
Citation Baxter, ADBird, JBhogal, RMassil, TMinton, KJMontana, JOwen, DA A novel series of matrix metalloproteinase inhibitors for the treatment of inflammatory disorders Bioorg Med Chem Lett7:897-902 (1997)    Article
 
Neutrophil collagenase
Name:Neutrophil collagenase
Type:PROTEIN
Mol. Mass.:53278.33
Organism:Rattus norvegicus
Description:ChEMBL_12591
Residue:466
BDBM50291447
NameBDBM50291447
Synonyms:(S)-2-(2-Mercapto-acetylamino)-4-methyl-pentanoic acid ((S)-1-methylcarbamoyl-2-thiazol-4-yl-ethyl)-amide | CHEMBL170021
TypeSmall organic molecule
Emp. Form.C15H24N4O3S2
Mol. Mass.372.506
SMILESCNC(=O)[C@H](Cc1cscn1)NC(=O)[C@H](CC(C)C)NC(=O)CS