Reaction Details
TargetNeutrophil collagenase
LigandBDBM50290672
Substrate/Competitorn/a
Meas. Tech.ChEMBL_105206 (CHEMBL713845)
IC50 50±n/a nM
Citation Baxter, ADBird, JBhogal, RMassil, TMinton, KJMontana, JOwen, DA A novel series of matrix metalloproteinase inhibitors for the treatment of inflammatory disorders Bioorg Med Chem Lett7:897-902 (1997)    Article
 
Neutrophil collagenase
Name:Neutrophil collagenase
Type:PROTEIN
Mol. Mass.:53278.33
Organism:Rattus norvegicus
Description:ChEMBL_12591
Residue:466
BDBM50290672
NameBDBM50290672
Synonyms:(S)-2-(2-Mercapto-acetylamino)-4-methyl-pentanoic acid ((S)-1-methylcarbamoyl-2-phenyl-ethyl)-amide | CHEMBL329145
TypeSmall organic molecule
Emp. Form.C18H27N3O3S
Mol. Mass.365.49
SMILESCNC(=O)[C@H](Cc1ccccc1)NC(=O)[C@H](CC(C)C)NC(=O)CS