Reaction Details
TargetEndothelin receptor type B
LigandBDBM50291492
Substrate/Competitorn/a
Meas. Tech.ChEBML_63711
IC50 5245±n/a nM
Citation Raju, BOkun, IStavros, FChan, MF Amide bond surrogates: A study in thiophenesulfonamide based endothelin receptor antagonists Bioorg Med Chem Lett7:939-944 (1997)    Article
 
Endothelin receptor type B
Name:Endothelin receptor type B
Type:Enzyme Catalytic Domain
Mol. Mass.:49664.00
Organism:Homo sapiens (Human)
Description:ENDOTHELIN B EDNRB HUMAN::P24530
Residue:442
BDBM50291492
NameBDBM50291492
Synonyms:2-(2-Benzo[1,3]dioxol-5-yl-vinyl)-thiophene-3-sulfonic acid (4-bromo-3-methyl-isoxazol-5-yl)-amide | CHEMBL367763
TypeSmall organic molecule
Emp. Form.C17H13BrN2O5S2
Mol. Mass.469.33
SMILESCc1noc(NS(=O)(=O)c2ccsc2\C=C\c2ccc3OCOc3c2)c1Br