Reaction Details
TargetEndothelin receptor type B
LigandBDBM50291497
Substrate/Competitorn/a
Meas. Tech.ChEBML_63711
IC50 6635±n/a nM
Citation Raju, BOkun, IStavros, FChan, MF Amide bond surrogates: A study in thiophenesulfonamide based endothelin receptor antagonists Bioorg Med Chem Lett7:939-944 (1997)    Article
 
Endothelin receptor type B
Name:Endothelin receptor type B
Type:Enzyme Catalytic Domain
Mol. Mass.:49664.00
Organism:Homo sapiens (Human)
Description:ENDOTHELIN B EDNRB HUMAN::P24530
Residue:442
BDBM50291497
NameBDBM50291497
Synonyms:3-(2-p-Tolyl-vinyl)-thiophene-2-sulfonic acid (4-bromo-3-methyl-isoxazol-5-yl)-amide | CHEMBL176912
TypeSmall organic molecule
Emp. Form.C17H15BrN2O3S2
Mol. Mass.439.347
SMILESCc1noc(NS(=O)(=O)c2sccc2\C=C\c2ccc(C)cc2)c1Br