Reaction Details
TargetEndothelin receptor type B
LigandBDBM50291500
Substrate/Competitorn/a
Meas. Tech.ChEBML_63711
IC50 12450±n/a nM
Citation Raju, BOkun, IStavros, FChan, MF Amide bond surrogates: A study in thiophenesulfonamide based endothelin receptor antagonists Bioorg Med Chem Lett7:939-944 (1997)    Article
 
Endothelin receptor type B
Name:Endothelin receptor type B
Type:Enzyme Catalytic Domain
Mol. Mass.:49664.00
Organism:Homo sapiens (Human)
Description:ENDOTHELIN B EDNRB HUMAN::P24530
Residue:442
BDBM50291500
NameBDBM50291500
Synonyms:3-[2-(6-Methyl-benzo[1,3]dioxol-5-yl)-ethyl]-thiophene-2-sulfonic acid (4-bromo-3-methyl-isoxazol-5-yl)-amide | CHEMBL366378
TypeSmall organic molecule
Emp. Form.C18H17BrN2O5S2
Mol. Mass.485.372
SMILESCc1noc(NS(=O)(=O)c2sccc2CCc2cc3OCOc3cc2C)c1Br