Reaction Details
TargetEndothelin-1 receptor
LigandBDBM50291502
Substrate/Competitorn/a
Meas. Tech.ChEBML_65629
IC50 218±n/a nM
Citation Raju, BOkun, IStavros, FChan, MF Amide bond surrogates: A study in thiophenesulfonamide based endothelin receptor antagonists Bioorg Med Chem Lett7:939-944 (1997)    Article
 
Endothelin-1 receptor
Name:Endothelin-1 receptor
Type:Enzyme Catalytic Domain
Mol. Mass.:48736.88
Organism:Homo sapiens (Human)
Description:P25101
Residue:427
BDBM50291502
NameBDBM50291502
Synonyms:3-(2-Benzo[1,3]dioxol-5-yl-vinyl)-thiophene-2-sulfonic acid (4-bromo-3-methyl-isoxazol-5-yl)-amide | CHEMBL174363
TypeSmall organic molecule
Emp. Form.C17H13BrN2O5S2
Mol. Mass.469.33
SMILESCc1noc(NS(=O)(=O)c2sccc2\C=C\c2ccc3OCOc3c2)c1Br