Reaction Details
TargetEndothelin receptor type B
LigandBDBM50291490
Substrate/Competitorn/a
Meas. Tech.ChEBML_63711
IC50 1720±n/a nM
Citation Raju, BOkun, IStavros, FChan, MF Amide bond surrogates: A study in thiophenesulfonamide based endothelin receptor antagonists Bioorg Med Chem Lett7:939-944 (1997)    Article
 
Endothelin receptor type B
Name:Endothelin receptor type B
Type:Enzyme Catalytic Domain
Mol. Mass.:49664.00
Organism:Homo sapiens (Human)
Description:ENDOTHELIN B EDNRB HUMAN::P24530
Residue:442
BDBM50291490
NameBDBM50291490
Synonyms:3-[2-(2,4,6-Trimethyl-phenyl)-vinyl]-thiophene-2-sulfonic acid (4-bromo-3-methyl-isoxazol-5-yl)-amide | CHEMBL172248
TypeSmall organic molecule
Emp. Form.C19H19BrN2O3S2
Mol. Mass.467.4
SMILESCc1noc(NS(=O)(=O)c2sccc2\C=C\c2c(C)cc(C)cc2C)c1Br