Reaction Details
TargetEndothelin receptor type B
LigandBDBM50291485
Substrate/Competitorn/a
Meas. Tech.ChEBML_63711
IC50 9240±n/a nM
Citation Raju, BOkun, IStavros, FChan, MF Amide bond surrogates: A study in thiophenesulfonamide based endothelin receptor antagonists Bioorg Med Chem Lett7:939-944 (1997)    Article
 
Endothelin receptor type B
Name:Endothelin receptor type B
Type:Enzyme Catalytic Domain
Mol. Mass.:49664.00
Organism:Homo sapiens (Human)
Description:ENDOTHELIN B EDNRB HUMAN::P24530
Residue:442
BDBM50291485
NameBDBM50291485
Synonyms:2-(2-Benzo[1,3]dioxol-5-yl-ethyl)-thiophene-3-sulfonic acid (4-bromo-3-methyl-isoxazol-5-yl)-amide | CHEMBL173982
TypeSmall organic molecule
Emp. Form.C17H15BrN2O5S2
Mol. Mass.471.345
SMILESCc1noc(NS(=O)(=O)c2ccsc2CCc2ccc3OCOc3c2)c1Br