Reaction Details
TargetEndothelin-1 receptor
LigandBDBM50291500
Substrate/Competitorn/a
Meas. Tech.ChEBML_65629
IC50 91±n/a nM
Citation Raju, BOkun, IStavros, FChan, MF Amide bond surrogates: A study in thiophenesulfonamide based endothelin receptor antagonists Bioorg Med Chem Lett7:939-944 (1997)    Article
 
Endothelin-1 receptor
Name:Endothelin-1 receptor
Type:Enzyme Catalytic Domain
Mol. Mass.:48736.88
Organism:Homo sapiens (Human)
Description:P25101
Residue:427
BDBM50291500
NameBDBM50291500
Synonyms:3-[2-(6-Methyl-benzo[1,3]dioxol-5-yl)-ethyl]-thiophene-2-sulfonic acid (4-bromo-3-methyl-isoxazol-5-yl)-amide | CHEMBL366378
TypeSmall organic molecule
Emp. Form.C18H17BrN2O5S2
Mol. Mass.485.372
SMILESCc1noc(NS(=O)(=O)c2sccc2CCc2cc3OCOc3cc2C)c1Br