Reaction Details
TargetMuscarinic acetylcholine receptor M2
LigandBDBM50004665
Substrate/Competitorn/a
Meas. Tech.ChEMBL_138346 (CHEMBL747776)
IC50 2000±n/a nM
Citation Conti, PDallanoce, CAmici, MDMicheli, CDEbert, B Synthesis and binding affinity of new muscarinic ligands structurally related to oxotremorine Bioorg Med Chem Lett7:1033-1036 (1997)    Article
 
Muscarinic acetylcholine receptor M2
Name:Muscarinic acetylcholine receptor M2
Type:Enzyme Catalytic Domain
Mol. Mass.:51555.53
Organism:RAT
Description:P10980
Residue:466
BDBM50004665
NameBDBM50004665
Synonyms:(oxotremorine)1-(4-Pyrrolidin-1-yl-but-2-ynyl)-pyrrolidin-2-one 1-(4-Pyrrolidin-1-yl-but-2-ynyl)-pyrrolidin-2-one (oxotremorphine) 1-[4-(2-oxo-pyrrolidin-1-yl)-but-2-ynyl]-pyrrolidinium Oxotremorine cid_4630
TypeSmall organic molecule
Emp. Form.C12H18N2O
Mol. Mass.206.2841
SMILESO=C1CCCN1CC#CCN1CCCC1