Reaction Details
TargetNeutrophil elastase
LigandBDBM50291760
Substrate/Competitorn/a
Meas. Tech.ChEMBL_63835 (CHEMBL872885)
Ki 0.940000±n/a nM
Citation Krantz, ASpencer, RWTam, TFThomas, ECopp, LJ. Design of alternate substrate inhibitors of serine proteases. Synergistic use of alkyl substitution to impede enzyme-catalyzed deacylation. J Med Chem30:589-591 (1987) 
 
Neutrophil elastase
Name:Neutrophil elastase
Type:Enzyme
Mol. Mass.:28532.38
Organism:Homo sapiens (Human)
Description:P08246
Residue:267
BDBM50291760
NameBDBM50291760
Synonyms:5-Ethyl-2-isopropylamino-benzo[d][1,3]oxazin-4-one | CHEMBL145550
TypeSmall organic molecule
Emp. Form.C13H16N2O2
Mol. Mass.232.2783
SMILESCCc1cccc2nc(NC(C)C)oc(=O)c12