Reaction Details
TargetHistamine H1 receptor
LigandBDBM50292411
Substrate/Competitorn/a
Meas. Tech.ChEMBL_485925 (CHEMBL1013928)
Ki 1.6±n/a nM
Citation Sweetnam, PMCaldwell, LLancaster, JJr., CBMcMillan, BKinnier, WJPrice, CH The Role of Receptor Binding in Drug Discovery J Nat Prod56:441-455 (1993) 
 
Histamine H1 receptor
Name:Histamine H1 receptor
Type:G Protein-Coupled Receptor (GPCR)
Mol. Mass.:55808.72
Organism:Homo sapiens (Human)
Description:Cell pellets from SK-N-MC cells transfected with human H1 receptor were used in binding assay.
Residue:487
BDBM50292411
NameBDBM50292411
Synonyms:(E)-2-(3-(pyrrolidin-1-yl)-1-p-tolylprop-1-enyl)pyridine 2-((E)-3-Pyrrolidin-1-yl-1-p-tolyl-propenyl)-pyridine 2-(3-Pyrrolidin-1-yl-1-p-tolyl-propenyl)-pyridine Actidil Allerfed Corphed Myfed TRIPROLIDINE Trilitron Triprolidin
TypeSmall organic molecule
Emp. Form.C19H22N2
Mol. Mass.278.3914
SMILESCc1ccc(cc1)C(=C/CN1CCCC1)\c1ccccn1