Reaction Details
TargetSeed linoleate 13S-lipoxygenase-1
LigandBDBM50242263
Substrate/Competitorn/a
Meas. Tech.ChEMBL_486310 (CHEMBL1009539)
IC50>250000±n/a nM
Citation Shobha, SVRamadoss, CSRavindranath, B Inhibition of Soybean Lipoxygenase-1 by Anacardic Acids, Cardols, and Cardanols J Nat Prod57:1755-1757 (1994)    Article
 
Seed linoleate 13S-lipoxygenase-1
Name:Seed linoleate 13S-lipoxygenase-1
Type:Enzyme
Mol. Mass.:94365.66
Organism:Glycine max (soybean)
Description:n/a
Residue:839
BDBM50242263
NameBDBM50242263
Synonyms:(Z)-3-(pentadec-8-enyl)phenol 5-{8(Z)-pentadecenyl}phenol | CHEMBL470263
TypeSmall organic molecule
Emp. Form.C21H34O
Mol. Mass.302.4941
SMILESCCCCCC\C=C/CCCCCCCc1cccc(O)c1