Reaction Details
TargetAmine oxidase [flavin-containing] B
LigandBDBM50012278
Substrate/Competitorn/a
Meas. Tech.ChEMBL_506191 (CHEMBL941395)
Ki 77000±n/a nM
Citation Rosazza, JPDuffel, MWEl-Marakby, SAhn, SH Metabolism of the Catharanthus Alkaloids: from Streptomyces griseus to Monoamine Oxidase B J Nat Prod55:269-284 (1992) 
 
Amine oxidase [flavin-containing] B
Name:Amine oxidase [flavin-containing] B
Type:PROTEIN
Mol. Mass.:58428.94
Organism:Bos taurus
Description:ChEMBL_1501478
Residue:520
BDBM50012278
NameBDBM50012278
Synonyms:(2ALPHA,2''BETA,3BETA,4ALPHA,5BETA)-VINCALEUKOBLASTINE VINBLASTINE cid_5388983
TypeSmall organic molecule
Emp. Form.C46H58N4O9
Mol. Mass.810.9741
SMILESCC[C@]1(O)C[C@@H]2CN(C1)CCc1c([nH]c3ccccc13)[C@@](C2)(C(=O)OC)c1cc2c(cc1OC)N(C)[C@@H]1[C@]22CCN3CC=C[C@](CC)([C@@H]23)[C@@H](OC(C)=O)[C@]1(O)C(=O)OC