Reaction Details
TargetEpidermal growth factor receptor
LigandBDBM50025607
Substrate/Competitorn/a
Meas. Tech.ChEMBL_506208 (CHEMBL941412)
IC50 31900±n/a nM
Citation Chang, CJGeahlen, RL Protein-Tyrosine Kinase Inhibition: Mechanism-Based Discovery of Antitumor Agents J Nat Prod55:1529-1560 (1992) 
 
Epidermal growth factor receptor
Name:Epidermal growth factor receptor
Type:Receptor Kinase Domain
Mol. Mass.:134279.59
Organism:Homo sapiens (Human)
Description:P00533
Residue:1210
BDBM50025607
NameBDBM50025607
Synonyms:CHEMBL490980
TypeSmall organic molecule
Emp. Form.C16H11NO6
Mol. Mass.313.2616
SMILESNC(=O)c1oc2cc(O)cc(O)c2c(=O)c1-c1ccc(O)cc1