Reaction Details
TargetEpidermal growth factor receptor
LigandBDBM50025613
Substrate/Competitorn/a
Meas. Tech.ChEMBL_506208 (CHEMBL941412)
IC50 5840±n/a nM
Citation Chang, CJGeahlen, RL Protein-Tyrosine Kinase Inhibition: Mechanism-Based Discovery of Antitumor Agents J Nat Prod55:1529-1560 (1992) 
 
Epidermal growth factor receptor
Name:Epidermal growth factor receptor
Type:Receptor Kinase Domain
Mol. Mass.:134279.59
Organism:Homo sapiens (Human)
Description:P00533
Residue:1210
BDBM50025613
NameBDBM50025613
Synonyms:CHEMBL489139
TypeSmall organic molecule
Emp. Form.C18H14O7
Mol. Mass.342.2996
SMILESCCOC(=O)c1oc2cc(O)cc(O)c2c(=O)c1-c1ccc(O)cc1