Reaction Details
TargetEpidermal growth factor receptor
LigandBDBM4375
Substrate/Competitorn/a
Meas. Tech.ChEMBL_506200 (CHEMBL941404)
IC50 1000000±n/a nM
Citation Chang, CJGeahlen, RL Protein-Tyrosine Kinase Inhibition: Mechanism-Based Discovery of Antitumor Agents J Nat Prod55:1529-1560 (1992) 
 
Epidermal growth factor receptor
Name:Epidermal growth factor receptor
Type:Receptor Kinase Domain
Mol. Mass.:134279.59
Organism:Homo sapiens (Human)
Description:P00533
Residue:1210
BDBM4375
NameBDBM4375
Synonyms:(2E)-3-(3,4-dihydroxyphenyl)prop-2-enoic acid 3,4-Dihydroxycinnamate, XVII Caffeic acid cid_689043
TypeSmall organic molecule
Emp. Form.C9H8O4
Mol. Mass.180.1574
SMILESOC(=O)\C=C\c1ccc(O)c(O)c1