Reaction Details
TargetTyrosine-protein kinase transforming protein Abl
LigandBDBM50292481
Substrate/Competitorn/a
Meas. Tech.ChEMBL_506213 (CHEMBL942402)
IC50 20000±n/a nM
Citation Chang, CJGeahlen, RL Protein-Tyrosine Kinase Inhibition: Mechanism-Based Discovery of Antitumor Agents J Nat Prod55:1529-1560 (1992) 
 
Tyrosine-protein kinase transforming protein Abl
Name:Tyrosine-protein kinase transforming protein Abl
Type:Enzyme
Mol. Mass.:81895.89
Organism:Abelson murine leukemia virus
Description:P00521
Residue:746
BDBM50292481
NameBDBM50292481
Synonyms:4-(2-nitrovinyl)phenyl 4-((S)-1-((S)-1-(2-aminoethylamino)-1-oxopropan-2-ylamino)-1-oxopropan-2-ylcarbamoyl)benzenesulfonate hydrochloride | CHEMBL488101
TypeSmall organic molecule
Emp. Form.C23H27N5O8S
Mol. Mass.533.554
SMILESCC(NC(=O)C(C)NC(=O)c1ccc(cc1)[S+]([O-])(=O)Oc1ccc(\C=C\[N+]([O-])=O)cc1)C(=O)NCCN