Reaction Details
TargetTyrosine-protein kinase transforming protein Abl
LigandBDBM50007064
Substrate/Competitorn/a
Meas. Tech.ChEMBL_506213 (CHEMBL942402)
IC50 30000±n/a nM
Citation Chang, CJGeahlen, RL Protein-Tyrosine Kinase Inhibition: Mechanism-Based Discovery of Antitumor Agents J Nat Prod55:1529-1560 (1992) 
 
Tyrosine-protein kinase transforming protein Abl
Name:Tyrosine-protein kinase transforming protein Abl
Type:Enzyme
Mol. Mass.:81895.89
Organism:Abelson murine leukemia virus
Description:P00521
Residue:746
BDBM50007064
NameBDBM50007064
Synonyms:2-Hydroxy-4-[4-(2-nitro-vinyl)-phenoxysulfonyl]-benzoic acid CHEMBL449093
TypeSmall organic molecule
Emp. Form.C15H11NO8S
Mol. Mass.365.315
SMILESOC(=O)c1ccc(cc1O)[S+]([O-])(=O)Oc1ccc(\C=C\[N+]([O-])=O)cc1