Reaction Details
TargetTyrosine-protein kinase transforming protein Abl
LigandBDBM50292484
Substrate/Competitorn/a
Meas. Tech.ChEMBL_506213 (CHEMBL942402)
IC50 40000±n/a nM
Citation Chang, CJGeahlen, RL Protein-Tyrosine Kinase Inhibition: Mechanism-Based Discovery of Antitumor Agents J Nat Prod55:1529-1560 (1992) 
 
Tyrosine-protein kinase transforming protein Abl
Name:Tyrosine-protein kinase transforming protein Abl
Type:Enzyme
Mol. Mass.:81895.89
Organism:Abelson murine leukemia virus
Description:P00521
Residue:746
BDBM50292484
NameBDBM50292484
Synonyms:CHEMBL509039 | {[(2R,3S,4R,5R)-5-(6-amino-9H-purin-9-yl)-3,4-dihydroxyoxolan-2-yl]methoxy}({[({[4-(2-carbamoyl-2-acetamidoethyl)phenyl]amino}(hydroxy)phosphoryl)oxy](hydroxy)phosphoryl}oxy)phosphinic acid
TypeSmall organic molecule
Emp. Form.C21H29N8O14P3
Mol. Mass.710.4214
SMILESCC(=O)NC(Cc1ccc(NP(O)(=O)OP(O)(=O)OP(O)(=O)OC[C@H]2O[C@H]([C@H](O)[C@@H]2O)n2cnc3c(N)ncnc23)cc1)C(N)=O