Reaction Details
TargetTyrosine-protein kinase transforming protein Abl
LigandBDBM50007077
Substrate/Competitorn/a
Meas. Tech.ChEMBL_506213 (CHEMBL942402)
IC50 40000±n/a nM
Citation Chang, CJGeahlen, RL Protein-Tyrosine Kinase Inhibition: Mechanism-Based Discovery of Antitumor Agents J Nat Prod55:1529-1560 (1992) 
 
Tyrosine-protein kinase transforming protein Abl
Name:Tyrosine-protein kinase transforming protein Abl
Type:Enzyme
Mol. Mass.:81895.89
Organism:Abelson murine leukemia virus
Description:P00521
Residue:746
BDBM50007077
NameBDBM50007077
Synonyms:4-(2-methoxy-4-(2-nitrovinyl)phenoxysulfonyl)benzoic acid CHEMBL418907
TypeSmall organic molecule
Emp. Form.C16H13NO8S
Mol. Mass.379.341
SMILESCOc1cc(\C=C\[N+]([O-])=O)ccc1O[S+]([O-])(=O)c1ccc(cc1)C(O)=O