Reaction Details
TargetTyrosine-protein kinase transforming protein Abl
LigandBDBM50007072
Substrate/Competitorn/a
Meas. Tech.ChEMBL_506213 (CHEMBL942402)
IC50>40000±n/a nM
Citation Chang, CJGeahlen, RL Protein-Tyrosine Kinase Inhibition: Mechanism-Based Discovery of Antitumor Agents J Nat Prod55:1529-1560 (1992) 
 
Tyrosine-protein kinase transforming protein Abl
Name:Tyrosine-protein kinase transforming protein Abl
Type:Enzyme
Mol. Mass.:81895.89
Organism:Abelson murine leukemia virus
Description:P00521
Residue:746
BDBM50007072
NameBDBM50007072
Synonyms:4-(2-nitrovinyl)phenyl 4-(methylcarbamoyl)benzenesulfonate CHEMBL74432
TypeSmall organic molecule
Emp. Form.C16H14N2O6S
Mol. Mass.362.357
SMILESCNC(=O)c1ccc(cc1)[S+]([O-])(=O)Oc1ccc(\C=C\[N+]([O-])=O)cc1