Reaction Details
TargetTyrosine-protein kinase transforming protein Abl
LigandBDBM50292485
Substrate/Competitorn/a
Meas. Tech.ChEMBL_506213 (CHEMBL942402)
IC50 40000±n/a nM
Citation Chang, CJGeahlen, RL Protein-Tyrosine Kinase Inhibition: Mechanism-Based Discovery of Antitumor Agents J Nat Prod55:1529-1560 (1992) 
 
Tyrosine-protein kinase transforming protein Abl
Name:Tyrosine-protein kinase transforming protein Abl
Type:Enzyme
Mol. Mass.:81895.89
Organism:Abelson murine leukemia virus
Description:P00521
Residue:746
BDBM50292485
NameBDBM50292485
Synonyms:(S)-2-((S)-2-(4-(4-(2-nitrovinyl)phenoxysulfonyl)benzamido)propanamido)propanoic acid | CHEMBL490775
TypeSmall organic molecule
Emp. Form.C21H21N3O9S
Mol. Mass.491.471
SMILESCC(NC(=O)C(C)NC(=O)c1ccc(cc1)[S+]([O-])(=O)Oc1ccc(\C=C\[N+]([O-])=O)cc1)C(O)=O