Reaction Details
TargetTyrosine-protein kinase transforming protein Abl
LigandBDBM50292494
Substrate/Competitorn/a
Meas. Tech.ChEMBL_506213 (CHEMBL942402)
IC50 10000±n/a nM
Citation Chang, CJGeahlen, RL Protein-Tyrosine Kinase Inhibition: Mechanism-Based Discovery of Antitumor Agents J Nat Prod55:1529-1560 (1992) 
 
Tyrosine-protein kinase transforming protein Abl
Name:Tyrosine-protein kinase transforming protein Abl
Type:Enzyme
Mol. Mass.:81895.89
Organism:Abelson murine leukemia virus
Description:P00521
Residue:746
BDBM50292494
NameBDBM50292494
Synonyms:CHEMBL485064 | {[(2R,3S,4R,5R)-5-(6-amino-9H-purin-9-yl)-3,4-dihydroxyoxolan-2-yl]methoxy}({[hydroxy({[hydroxy(phenoxy)phosphoryl]oxy})phosphoryl]oxy})phosphinic acid
TypeSmall organic molecule
Emp. Form.C16H20N5O13P3
Mol. Mass.583.277
SMILESNc1ncnc2n(cnc12)[C@@H]1O[C@H](COP(O)(=O)OP(O)(=O)OP(O)(=O)Oc2ccccc2)[C@@H](O)[C@H]1O