Reaction Details
TargetEpidermal growth factor receptor
LigandBDBM50292525
Substrate/Competitorn/a
Meas. Tech.ChEMBL_506200 (CHEMBL941404)
IC50 20000±n/a nM
Citation Chang, CJGeahlen, RL Protein-Tyrosine Kinase Inhibition: Mechanism-Based Discovery of Antitumor Agents J Nat Prod55:1529-1560 (1992) 
 
Epidermal growth factor receptor
Name:Epidermal growth factor receptor
Type:Receptor Kinase Domain
Mol. Mass.:134279.59
Organism:Homo sapiens (Human)
Description:P00533
Residue:1210
BDBM50292525
NameBDBM50292525
Synonyms:CHEMBL501368 | trans-2-cyano-3-(2,5-dihydroxyphenyl)acrylic acid
TypeSmall organic molecule
Emp. Form.C10H7NO4
Mol. Mass.205.1669
SMILESOC(=O)C(=C\c1cc(O)ccc1O)\C#N