Reaction Details
TargetEpidermal growth factor receptor
LigandBDBM50292728
Substrate/Competitorn/a
Meas. Tech.ChEMBL_493905 (CHEMBL944276)
IC50 10.08±n/a nM
Citation La Motta, CSartini, STuccinardi, TNerini, EDa Settimo, FMartinelli, A Computational studies of epidermal growth factor receptor: docking reliability, three-dimensional quantitative structure-activity relationship analysis, and virtual screening studies. J Med Chem52:964-75 (2009) 
 
Epidermal growth factor receptor
Name:Epidermal growth factor receptor
Type:Receptor Kinase Domain
Mol. Mass.:134279.59
Organism:Homo sapiens (Human)
Description:P00533
Residue:1210
BDBM50292728
NameBDBM50292728
Synonyms:(7R,8R)-N-(3-chlorophenyl)-7,8-bis(methoxymethyl)-7,8-dihydro-[1,4]dioxino[2,3-g]quinazolin-4-amine | CHEMBL461792
TypeSmall organic molecule
Emp. Form.C20H20ClN3O4
Mol. Mass.401.843
SMILESCOC[C@H]1Oc2cc3ncnc(Nc4cccc(Cl)c4)c3cc2O[C@@H]1COC