Reaction Details
TargetEpidermal growth factor receptor
LigandBDBM50247802
Substrate/Competitorn/a
Meas. Tech.ChEMBL_493905 (CHEMBL944276)
IC50>50000±n/a nM
Citation La Motta, CSartini, STuccinardi, TNerini, EDa Settimo, FMartinelli, A Computational studies of epidermal growth factor receptor: docking reliability, three-dimensional quantitative structure-activity relationship analysis, and virtual screening studies. J Med Chem52:964-75 (2009) 
 
Epidermal growth factor receptor
Name:Epidermal growth factor receptor
Type:Receptor Kinase Domain
Mol. Mass.:134279.59
Organism:Homo sapiens (Human)
Description:P00533
Residue:1210
BDBM50247802
NameBDBM50247802
Synonyms:CHEMBL474538 N4-(3-bromophenyl)-6-(naphthalen-1-ylmethyl)-7H-pyrrolo[2,3-d]pyrimidine-2,4-diamine
TypeSmall organic molecule
Emp. Form.C23H18BrN5
Mol. Mass.444.327
SMILESNc1nc(Nc2cccc(Br)c2)c2cc(Cc3cccc4ccccc34)[nH]c2n1