Reaction Details
TargetEpidermal growth factor receptor
LigandBDBM50292739
Substrate/Competitorn/a
Meas. Tech.ChEMBL_493905 (CHEMBL944276)
IC50 5220±n/a nM
Citation La Motta, CSartini, STuccinardi, TNerini, EDa Settimo, FMartinelli, A Computational studies of epidermal growth factor receptor: docking reliability, three-dimensional quantitative structure-activity relationship analysis, and virtual screening studies. J Med Chem52:964-75 (2009) 
 
Epidermal growth factor receptor
Name:Epidermal growth factor receptor
Type:Receptor Kinase Domain
Mol. Mass.:134279.59
Organism:Homo sapiens (Human)
Description:P00533
Residue:1210
BDBM50292739
NameBDBM50292739
Synonyms:CHEMBL472943 | N-(4-(3-chloro-4-fluorophenylamino)-7-methoxyquinolin-6-yl)-4-(dimethylamino)pent-2-enamide
TypeSmall organic molecule
Emp. Form.C23H24ClFN4O2
Mol. Mass.442.914
SMILESCOc1cc2nccc(Nc3ccc(F)c(Cl)c3)c2cc1NC(=O)\C=C\C(C)N(C)C