Reaction Details
TargetEpidermal growth factor receptor
LigandBDBM50292741
Substrate/Competitorn/a
Meas. Tech.ChEMBL_493905 (CHEMBL944276)
IC50 7500±n/a nM
Citation La Motta, CSartini, STuccinardi, TNerini, EDa Settimo, FMartinelli, A Computational studies of epidermal growth factor receptor: docking reliability, three-dimensional quantitative structure-activity relationship analysis, and virtual screening studies. J Med Chem52:964-75 (2009) 
 
Epidermal growth factor receptor
Name:Epidermal growth factor receptor
Type:Receptor Kinase Domain
Mol. Mass.:134279.59
Organism:Homo sapiens (Human)
Description:P00533
Residue:1210
BDBM50292741
NameBDBM50292741
Synonyms:CHEMBL490687 | N-(4-(3-chloro-4-fluorophenylamino)-7-ethylquinolin-6-yl)but-2-enamide
TypeSmall organic molecule
Emp. Form.C21H19ClFN3O
Mol. Mass.383.846
SMILESCCc1cc2nccc(Nc3ccc(F)c(Cl)c3)c2cc1NC(=O)\C=C\C