Reaction Details
TargetMyelin-associated glycoprotein
LigandBDBM50292878
Substrate/Competitorn/a
Meas. Tech.ChEMBL_494375 (CHEMBL941168)
Kd 2830±n/a nM
Citation Schwardt, OGäthje, HVedani, AMesch, SGao, GPSpreafico, Mvon Orelli, JKelm, SErnst, B Examination of the biological role of the alpha(2-->6)-linked sialic acid in gangliosides binding to the myelin-associated glycoprotein (MAG). J Med Chem52:989-1004 (2009) 
 
Myelin-associated glycoprotein
Name:Myelin-associated glycoprotein
Type:PROTEIN
Mol. Mass.:69048.07
Organism:Homo sapiens (Human)
Description:ChEMBL_770764
Residue:626
BDBM50292878
NameBDBM50292878
Synonyms:(Sodium 5-Acetamido-9-(4-chlorobenzamido)-3,5,9-trideoxy-D-glycero-alpha-D-galacto-2-nonulopyranosynate)-(2->3)-beta-D-galactopyranosyl-(1->3)-1,5-anhydro-6-O-(biphenyl-4-yl-methyl)-2-deoxy-D-lyxo-hexitol | CHEMBL507374
TypeSmall organic molecule
Emp. Form.C42H50ClN2O17
Mol. Mass.890.303
SMILESCC(=O)N[C@@H]1[C@@H](O)C[C@@](O[C@H]2[C@@H](O)[C@@H](CO)O[C@@H](O[C@@H]3CCO[C@H](COc4ccc(cc4)-c4ccccc4)[C@@H]3O)[C@@H]2O)(O[C@H]1[C@@H](O)[C@H](O)CNC(=O)c1ccc(Cl)cc1)C([O-])=O