Reaction Details
TargetMyelin-associated glycoprotein
LigandBDBM50292879
Substrate/Competitorn/a
Meas. Tech.ChEMBL_494375 (CHEMBL941168)
Kd 5000±n/a nM
Citation Schwardt, OGäthje, HVedani, AMesch, SGao, GPSpreafico, Mvon Orelli, JKelm, SErnst, B Examination of the biological role of the alpha(2-->6)-linked sialic acid in gangliosides binding to the myelin-associated glycoprotein (MAG). J Med Chem52:989-1004 (2009) 
 
Myelin-associated glycoprotein
Name:Myelin-associated glycoprotein
Type:PROTEIN
Mol. Mass.:69048.07
Organism:Homo sapiens (Human)
Description:ChEMBL_770764
Residue:626
BDBM50292879
NameBDBM50292879
Synonyms:(Sodium 5-Acetamido-9-benzamido-3,5,9-trideoxy-D-glyceror-alpha-D-galacto-2-nonulopyranosynate)-(2->3)-beta-D-galactopyranosyl-(1->3)-1,5-anhydro-6-O-(biphenyl-4-yl-methyl)-2-deoxy-Dlyxo-hexitol | CHEMBL454284
TypeSmall organic molecule
Emp. Form.C42H51N2O17
Mol. Mass.855.8581
SMILESCC(=O)N[C@@H]1[C@@H](O)C[C@@](O[C@H]2[C@@H](O)[C@@H](CO)O[C@@H](O[C@@H]3CCO[C@H](COc4ccc(cc4)-c4ccccc4)[C@@H]3O)[C@@H]2O)(O[C@H]1[C@@H](O)[C@H](O)CNC(=O)c1ccccc1)C([O-])=O