Reaction Details
TargetVesicular acetylcholine transporter
LigandBDBM50292906
Substrate/Competitorn/a
Meas. Tech.ChEMBL_494628 (CHEMBL945287)
Ki 0.770000±n/a nM
Citation Tu, ZEfange, SMXu, JLi, SJones, LAParsons, SMMach, RH Synthesis and in vitro and in vivo evaluation of 18F-labeled positron emission tomography (PET) ligands for imaging the vesicular acetylcholine transporter. J Med Chem52:1358-69 (2009) 
 
Vesicular acetylcholine transporter
Name:Vesicular acetylcholine transporter
Type:PROTEIN
Mol. Mass.:56900.67
Organism:Homo sapiens (Human)
Description:ChEMBL_1507628
Residue:532
BDBM50292906
NameBDBM50292906
Synonyms:(2R,3R)-5-(3-fluoropropoxy)-3-(4-phenylpiperidin-1-yl)-1,2,3,4-tetrahydronaphthalen-2-ol | CHEMBL462659
TypeSmall organic molecule
Emp. Form.C24H30FNO2
Mol. Mass.383.4989
SMILESO[C@@H]1Cc2cccc(OCCCF)c2C[C@H]1N1CCC(CC1)c1ccccc1