Reaction Details
TargetSigma non-opioid intracellular receptor 1
LigandBDBM50292908
Substrate/Competitorn/a
Meas. Tech.ChEMBL_494629 (CHEMBL945288)
Ki 298±n/a nM
Citation Tu, ZEfange, SMXu, JLi, SJones, LAParsons, SMMach, RH Synthesis and in vitro and in vivo evaluation of 18F-labeled positron emission tomography (PET) ligands for imaging the vesicular acetylcholine transporter. J Med Chem52:1358-69 (2009) 
 
Sigma non-opioid intracellular receptor 1
Name:Sigma non-opioid intracellular receptor 1
Type:Protein
Mol. Mass.:25307.17
Organism:Cavia porcellus (Guinea pig)
Description:Q60492
Residue:223
BDBM50292908
NameBDBM50292908
Synonyms:(+/-)-trans-2-Hydroxy-3-(4-(4-bromobenzoyl)piperidino)tetralin Hydrochloride | CHEMBL473547
TypeSmall organic molecule
Emp. Form.C22H24BrNO2
Mol. Mass.414.335
SMILESO[C@@H]1Cc2ccccc2C[C@H]1N1CCC(CC1)C(=O)c1ccc(Br)cc1