Reaction Details
TargetPotassium voltage-gated channel subfamily H member 2
LigandBDBM50228363
Substrate/Competitorn/a
Meas. Tech.ChEMBL_495757 (CHEMBL1007876)
IC50>10000±n/a nM
Citation Vu, CBBemis, JEDisch, JSNg, PYNunes, JJMilne, JCCarney, DPLynch, AVSmith, JJLavu, SLambert, PDGagne, DJJirousek, MRSchenk, SOlefsky, JMPerni, RB Discovery of imidazo[1,2-b]thiazole derivatives as novel SIRT1 activators. J Med Chem52:1275-83 (2010) 
 
Potassium voltage-gated channel subfamily H member 2
Name:Potassium voltage-gated channel subfamily H member 2
Type:Multi-pass membrane protein
Mol. Mass.:126672.65
Organism:Homo sapiens (Human)
Description:Q12809
Residue:1159
BDBM50228363
NameBDBM50228363
Synonyms:CHEMBL257991 SRT-1720
TypeSmall organic molecule
Emp. Form.C25H23N7OS
Mol. Mass.469.561
SMILESO=C(Nc1ccccc1-c1cn2c(CN3CCNCC3)csc2n1)c1cnc2ccccc2n1