Reaction Details
TargetAlpha-2A adrenergic receptor
LigandBDBM50228363
Substrate/Competitorn/a
Meas. Tech.ChEMBL_495763 (CHEMBL1007882)
IC50 2830±n/a nM
Citation Vu, CBBemis, JEDisch, JSNg, PYNunes, JJMilne, JCCarney, DPLynch, AVSmith, JJLavu, SLambert, PDGagne, DJJirousek, MRSchenk, SOlefsky, JMPerni, RB Discovery of imidazo[1,2-b]thiazole derivatives as novel SIRT1 activators. J Med Chem52:1275-83 (2010) 
 
Alpha-2A adrenergic receptor
Name:Alpha-2A adrenergic receptor
Type:Enzyme
Mol. Mass.:48979.91
Organism:Homo sapiens (Human)
Description:P08913
Residue:465
BDBM50228363
NameBDBM50228363
Synonyms:CHEMBL257991 SRT-1720
TypeSmall organic molecule
Emp. Form.C25H23N7OS
Mol. Mass.469.561
SMILESO=C(Nc1ccccc1-c1cn2c(CN3CCNCC3)csc2n1)c1cnc2ccccc2n1