Reaction Details
TargetMuscarinic acetylcholine receptor M1
LigandBDBM50228363
Substrate/Competitorn/a
Meas. Tech.ChEMBL_495764 (CHEMBL1007883)
IC50 8020±n/a nM
Citation Vu, CBBemis, JEDisch, JSNg, PYNunes, JJMilne, JCCarney, DPLynch, AVSmith, JJLavu, SLambert, PDGagne, DJJirousek, MRSchenk, SOlefsky, JMPerni, RB Discovery of imidazo[1,2-b]thiazole derivatives as novel SIRT1 activators. J Med Chem52:1275-83 (2010) 
 
Muscarinic acetylcholine receptor M1
Name:Muscarinic acetylcholine receptor M1
Type:Protein
Mol. Mass.:51442.54
Organism:Homo sapiens (Human)
Description:P11229
Residue:460
BDBM50228363
NameBDBM50228363
Synonyms:CHEMBL257991 SRT-1720
TypeSmall organic molecule
Emp. Form.C25H23N7OS
Mol. Mass.469.561
SMILESO=C(Nc1ccccc1-c1cn2c(CN3CCNCC3)csc2n1)c1cnc2ccccc2n1