Reaction Details
TargetCyclin-dependent kinase 4
LigandBDBM8126
Substrate/Competitorn/a
Meas. Tech.ChEMBL_496923 (CHEMBL1002018)
IC50 12±n/a nM
Citation Stevens, KLReno, MJAlberti, JBPrice, DJKane-Carson, LSKnick, VBShewchuk, LMHassell, AMVeal, JMDavis, STGriffin, RJPeel, MR Synthesis and evaluation of pyrazolo[1,5-b]pyridazines as selective cyclin dependent kinase inhibitors. Bioorg Med Chem Lett18:5758-62 (2009) 
 
Cyclin-dependent kinase 4
Name:Cyclin-dependent kinase 4
Type:Enzyme Subunit
Mol. Mass.:33731.96
Organism:Homo sapiens (Human)
Description:P11802
Residue:303
BDBM8126
NameBDBM8126
Synonyms:N-phenyl-4-{pyrazolo[1,5-a]pyridazin-3-yl}pyrimidin-2-amine | pyrazolo[1,5-b]pyridazine deriv. 16
TypeSmall organic molecule
Emp. Form.C16H12N6
Mol. Mass.288.3067
SMILESN(c1ccccc1)c1nccc(n1)-c1cnn2ncccc12