Reaction Details
TargetCyclin-dependent kinase 4
LigandBDBM50293154
Substrate/Competitorn/a
Meas. Tech.ChEMBL_496923 (CHEMBL1002018)
IC50 4±n/a nM
Citation Stevens, KLReno, MJAlberti, JBPrice, DJKane-Carson, LSKnick, VBShewchuk, LMHassell, AMVeal, JMDavis, STGriffin, RJPeel, MR Synthesis and evaluation of pyrazolo[1,5-b]pyridazines as selective cyclin dependent kinase inhibitors. Bioorg Med Chem Lett18:5758-62 (2009) 
 
Cyclin-dependent kinase 4
Name:Cyclin-dependent kinase 4
Type:Enzyme Subunit
Mol. Mass.:33731.96
Organism:Homo sapiens (Human)
Description:P11802
Residue:303
BDBM50293154
NameBDBM50293154
Synonyms:3-(4-(pyrazolo[1,5-b]pyridazin-3-yl)pyrimidin-2-ylamino)benzonitrile | CHEMBL495696
TypeSmall organic molecule
Emp. Form.C17H11N7
Mol. Mass.313.3161
SMILESN#Cc1cccc(Nc2nccc(n2)-c2cnn3ncccc23)c1