Reaction Details
TargetGamma-aminobutyric acid receptor subunit alpha-3
LigandBDBM50293262
Substrate/Competitorn/a
Meas. Tech.ChEMBL_492500 (CHEMBL950413)
Ki 31±n/a nM
Citation Nilsson, JNielsen, EŘLiljefors, TNielsen, MSterner, O Azaflavones compared to flavones as ligands to the benzodiazepine binding site of brain GABA(A) receptors. Bioorg Med Chem Lett18:5713-6 (2009) 
 
Gamma-aminobutyric acid receptor subunit alpha-3
Name:Gamma-aminobutyric acid receptor subunit alpha-3
Type:Enzyme Catalytic Domain
Mol. Mass.:55444.88
Organism:RAT
Description:GABA A Alpha3Beta2Gamma2 0 RAT::P20236
Residue:493
BDBM50293262
NameBDBM50293262
Synonyms:2-(5-benzyl-2-hydroxyphenyl)-6-methylquinolin-4(1H)-one | CHEMBL502159
TypeSmall organic molecule
Emp. Form.C23H19NO2
Mol. Mass.341.4025
SMILESCc1ccc2nc(cc(O)c2c1)-c1cc(Cc2ccccc2)ccc1O