Reaction Details
TargetHistone deacetylase 2
LigandBDBM50293352
Substrate/Competitorn/a
Meas. Tech.ChEMBL_571846 (CHEMBL1034714)
IC50 220±n/a nM
Citation Dallavalle, SCincinelli, RNannei, RMerlini, LMorini, GPenco, SPisano, CVesci, LBarbarino, MZuco, VDe Cesare, MZunino, F Design, synthesis, and evaluation of biphenyl-4-yl-acrylohydroxamic acid derivatives as histone deacetylase (HDAC) inhibitors. Eur J Med Chem44:1900-12 (2009) 
 
Histone deacetylase 2
Name:Histone deacetylase 2
Type:Chromatin regulator; hydrolase; repressor
Mol. Mass.:55356.54
Organism:Homo sapiens (Human)
Description:Q92769
Residue:488
BDBM50293352
NameBDBM50293352
Synonyms:CHEMBL551486 | N-Hydroxy-E-3-[4'-hydroxymethylbiphenyl-4-yl]-acrylamide
TypeSmall organic molecule
Emp. Form.C16H15NO3
Mol. Mass.269.2952
SMILESOCc1ccc(cc1)-c1ccc(\C=C\C(=O)NO)cc1