Reaction Details
TargetProstaglandin E2 receptor EP2 subtype
LigandBDBM35847
Substrate/Competitorn/a
Meas. Tech.ChEMBL_570543 (CHEMBL1026915)
IC50 5.2±n/a nM
Citation Cameron, KOLefker, BAKe, HZLi, MZawistoski, MPTjoa, CMWright, ASDeNinno, SLParalkar, VMOwen, TAYu, LThompson, DD Discovery of CP-533536: an EP2 receptor selective prostaglandin E2 (PGE2) agonist that induces local bone formation. Bioorg Med Chem Lett19:2075-8 (2009) 
 
Prostaglandin E2 receptor EP2 subtype
Name:Prostaglandin E2 receptor EP2 subtype
Type:PROTEIN
Mol. Mass.:39786.37
Organism:Rattus norvegicus
Description:ChEMBL_1501400
Residue:357
BDBM35847
NameBDBM35847
Synonyms:(15S)-prostaglandin E2 (5Z,13E,15S)-11alpha,15-dihydroxy-9-oxoprosta-5,13-dien-1-oic acid CHEMBL548 PGE2 [3H]PGE2 prostaglandin E2
Typeradiolabeled ligand
Emp. Form.C20H32O5
Mol. Mass.352.4651
SMILESCCCCC[C@H](O)\C=C\[C@H]1[C@H](O)CC(=O)[C@@H]1C\C=C/CCCC(O)=O