Reaction Details
TargetFructose-1,6-bisphosphatase 1
LigandBDBM18137
Substrate/Competitorn/a
Meas. Tech.ChEMBL_571203 (CHEMBL1031962)
IC50 1300±n/a nM
Citation Heng, SGryncel, KRKantrowitz, ER A library of novel allosteric inhibitors against fructose 1,6-bisphosphatase. Bioorg Med Chem17:3916-22 (2009) 
 
Fructose-1,6-bisphosphatase 1
Name:Fructose-1,6-bisphosphatase 1
Type:Protein
Mol. Mass.:36781.07
Organism:Sus scrofa (Pig)
Description:Liver FBPase (P00636)
Residue:338
BDBM18137
NameBDBM18137
Synonyms:AMP US11185100, TABLE 7.3 adenosine 5 -monophosphate | {[(2R,3S,4R,5R)-5-(6-amino-9H-purin-9-yl)-3,4-dihydroxyoxolan-2-yl]methoxy}phosphonic acid
TypeNucleoside or nucleotide
Emp. Form.C10H14N5O7P
Mol. Mass.347.2212
SMILESNc1ncnc2n(cnc12)[C@@H]1O[C@H](COP(O)(O)=O)[C@@H](O)[C@H]1O