Reaction Details
TargetMetabotropic glutamate receptor 4
LigandBDBM50293721
Substrate/Competitorn/a
Meas. Tech.ChEMBL_571881 (CHEMBL1034751)
EC50 110±n/a nM
Citation Engers, DWNiswender, CMWeaver, CDJadhav, SMenon, UNZamorano, RConn, PJLindsley, CWHopkins, CR Synthesis and evaluation of a series of heterobiarylamides that are centrally penetrant metabotropic glutamate receptor 4 (mGluR4) positive allosteric modulators (PAMs). J Med Chem52:4115-8 (2009) 
 
Metabotropic glutamate receptor 4
Name:Metabotropic glutamate receptor 4
Type:Enzyme
Mol. Mass.:101849.79
Organism:Rattus norvegicus (Rat)
Description:P31423
Residue:912
BDBM50293721
NameBDBM50293721
Synonyms:CHEMBL562551 cid_44191096
TypeSmall organic molecule
Emp. Form.C13H11ClN2O2
Mol. Mass.262.692
SMILESCOc1cc(NC(=O)c2ccccn2)ccc1Cl