Reaction Details
TargetMetabotropic glutamate receptor 4
LigandBDBM50293716
Substrate/Competitorn/a
Meas. Tech.ChEMBL_571881 (CHEMBL1034751)
EC50 740±n/a nM
Citation Engers, DWNiswender, CMWeaver, CDJadhav, SMenon, UNZamorano, RConn, PJLindsley, CWHopkins, CR Synthesis and evaluation of a series of heterobiarylamides that are centrally penetrant metabotropic glutamate receptor 4 (mGluR4) positive allosteric modulators (PAMs). J Med Chem52:4115-8 (2009) 
 
Metabotropic glutamate receptor 4
Name:Metabotropic glutamate receptor 4
Type:Enzyme
Mol. Mass.:101849.79
Organism:Rattus norvegicus (Rat)
Description:P31423
Residue:912
BDBM50293716
NameBDBM50293716
Synonyms:CHEMBL562232 cid_2442621
TypeSmall organic molecule
Emp. Form.C13H11ClN2O2
Mol. Mass.262.692
SMILESCOc1ccc(NC(=O)c2ccccn2)cc1Cl