Reaction Details
TargetMetabotropic glutamate receptor 4
LigandBDBM50293729
Substrate/Competitorn/a
Meas. Tech.ChEMBL_571886 (CHEMBL1034756)
EC50>10000±n/a nM
Citation Engers, DWNiswender, CMWeaver, CDJadhav, SMenon, UNZamorano, RConn, PJLindsley, CWHopkins, CR Synthesis and evaluation of a series of heterobiarylamides that are centrally penetrant metabotropic glutamate receptor 4 (mGluR4) positive allosteric modulators (PAMs). J Med Chem52:4115-8 (2009) 
 
Metabotropic glutamate receptor 4
Name:Metabotropic glutamate receptor 4
Type:Protein
Mol. Mass.:101899.95
Organism:Homo sapiens (Human)
Description:Q14833
Residue:912
BDBM50293729
NameBDBM50293729
Synonyms:CHEMBL557685 cid_30268259
TypeSmall organic molecule
Emp. Form.C11H7Cl2NOS
Mol. Mass.272.15
SMILESClc1ccc(NC(=O)c2ccsc2)cc1Cl